# \#fastlane

**URL:** https://discuss.circleci.com/tag/fastlane/108.md

[Latest](https://discuss.circleci.com/latest.md) · [Categories](https://discuss.circleci.com/categories.md) · [Tags](https://discuss.circleci.com/tags.md)

---

## [Invalid MATCH\_PASSWORD fastlane](https://discuss.circleci.com/t/invalid-match-password-fastlane/52092)

<div class="topic-metadata">

**Author:** [@iamMohamed](https://discuss.circleci.com/u/iamMohamed)\
**Replies:** 2\
**Last updated:** [November 24, 2025, 6:06am UTC](https://discuss.circleci.com/t/invalid-match-password-fastlane/52092 "2025-11-24T06:06:53Z")

</div>

I configured MATCH\_PASSWORD in circle CI env but every time it’s start building it’s failed in code-signing but when I run the same lane in the local it able to decrypt the certificate. both password are same Can someon…

---

## [Xcode iOS build failures cocoapods "Copy XCFrameworks"](https://discuss.circleci.com/t/xcode-ios-build-failures-cocoapods-copy-xcframeworks/52235)

<div class="topic-metadata">

**Author:** [@idomizrachi-bringg](https://discuss.circleci.com/u/idomizrachi-bringg)\
**Replies:** 2\
**Last updated:** [October 31, 2024, 11:11am UTC](https://discuss.circleci.com/t/xcode-ios-build-failures-cocoapods-copy-xcframeworks/52235 "2024-10-31T11:11:09Z")

</div>

Since around 8 days agos all of our jobs fail with the following error: ▸ Running script ‘\[CP\] Copy XCFrameworks’ :x: error: Sandbox: rsync.samba(12267) deny(1) file-write-create /Users/distiller/project/App1/build/De…

---

## [Multiple Xcode version?](https://discuss.circleci.com/t/multiple-xcode-version/50304)

<div class="topic-metadata">

**Author:** [@Skyline-23](https://discuss.circleci.com/u/Skyline-23)\
**Replies:** 1\
**Last updated:** [February 12, 2024, 8:24pm UTC](https://discuss.circleci.com/t/multiple-xcode-version/50304 "2024-02-12T20:24:36Z")

</div>

Hello. I’m iOS Developer using circle ci & Fastlane My Fastlane occurs this error when build on circle ci. It works on my machine. \[04:10:58\]: Exit status: 65 \[04:10:58\]: \[04:10:58\]: Maybe the error shown is caused by…

---

## [Fastlane failing on some branches](https://discuss.circleci.com/t/fastlane-failing-on-some-branches/49494)

<div class="topic-metadata">

**Author:** [@aboatti](https://discuss.circleci.com/u/aboatti)\
**Replies:** 4\
**Last updated:** [February 12, 2024, 8:21pm UTC](https://discuss.circleci.com/t/fastlane-failing-on-some-branches/49494 "2024-02-12T20:21:19Z")

</div>

Started getting this error yesterday, there have been no recent changes to config.yml or fastfile

---

## [Moving CircleCI from XCode 13.2.1 to 14.2.0 blew up CircleCI with Exit status: 65](https://discuss.circleci.com/t/moving-circleci-from-xcode-13-2-1-to-14-2-0-blew-up-circleci-with-exit-status-65/47528)

<div class="topic-metadata">

**Author:** [@nwainwright](https://discuss.circleci.com/u/nwainwright)\
**Replies:** 14\
**Last updated:** [December 1, 2023, 12:54pm UTC](https://discuss.circleci.com/t/moving-circleci-from-xcode-13-2-1-to-14-2-0-blew-up-circleci-with-exit-status-65/47528 "2023-12-01T12:54:48Z")

</div>

Hi there, we updated our config.yml to specify XCode 14.2.0 and now nothing will build. “ARCHIVE FAILED with Exit status: 65” Apple needs all of us to build with XCode 14.2.0 for App Store releases and we can’t find any …

---

## [CircleCI Fastlane run\_test on real ios device](https://discuss.circleci.com/t/circleci-fastlane-run-test-on-real-ios-device/47559)

<div class="topic-metadata">

**Author:** [@deshan](https://discuss.circleci.com/u/deshan)\
**Replies:** 0\
**Last updated:** [March 24, 2023, 8:11am UTC](https://discuss.circleci.com/t/circleci-fastlane-run-test-on-real-ios-device/47559 "2023-03-24T08:11:31Z")

</div>

Hi I am trying to run ios unit/ui tests on a real ios device with fastlane. Some frameworks I am using not support iOS emulator so testing on real device is need. For local environment fastlane testing on device no iss…

---

## [Why IOS fastlane release fails to find signing certificate when running in CircleCI macos: xcode: 14.2](https://discuss.circleci.com/t/why-ios-fastlane-release-fails-to-find-signing-certificate-when-running-in-circleci-macos-xcode-14-2/47421)

<div class="topic-metadata">

**Author:** [@eluzgin](https://discuss.circleci.com/u/eluzgin)\
**Replies:** 1\
**Last updated:** [March 21, 2023, 7:50pm UTC](https://discuss.circleci.com/t/why-ios-fastlane-release-fails-to-find-signing-certificate-when-running-in-circleci-macos-xcode-14-2/47421 "2023-03-21T19:50:53Z")

</div>

Some background information: The distribution certificate is stored in private Git repository. When running locally - fastlane match installs certificate to login Keystore and fastlane release builds application archive …

---

## [An exception has occurred: issuerId is required](https://discuss.circleci.com/t/an-exception-has-occurred-issuerid-is-required/45835)

<div class="topic-metadata">

**Author:** [@nwainwright](https://discuss.circleci.com/u/nwainwright)\
**Replies:** 1\
**Last updated:** [November 1, 2022, 4:36pm UTC](https://discuss.circleci.com/t/an-exception-has-occurred-issuerid-is-required/45835 "2022-11-01T16:36:58Z")

</div>

Hi everyone, fastlane has started failing to send builds to the Apple App Store. Setting this environment variable in our CircleCI confg.yml file worked around it. the ITMSTRANSPORTER environment variable.

---

## [Flutter IOS, ARCHIVE FAILED after upgraded Xcode to 13.0.0](https://discuss.circleci.com/t/flutter-ios-archive-failed-after-upgraded-xcode-to-13-0-0/41435)

<div class="topic-metadata">

**Author:** [@Harol](https://discuss.circleci.com/u/Harol)\
**Replies:** 6\
**Last updated:** [March 29, 2022, 5:15pm UTC](https://discuss.circleci.com/t/flutter-ios-archive-failed-after-upgraded-xcode-to-13-0-0/41435 "2022-03-29T17:15:24Z")

</div>

Hi, I’ve been deploying our Flutter application through CircleCi with Xcode 12.4.0. But, after upgrading Xcode to 13.0.0 (Not the beta version) in the config.yml file, the Fastlane build\_app action doesn’t succeed anymo…

---

## [How to call fastlane scan with the --clean parameter using CircleCI?](https://discuss.circleci.com/t/how-to-call-fastlane-scan-with-the-clean-parameter-using-circleci/32480)

<div class="topic-metadata">

**Author:** [@haikusw](https://discuss.circleci.com/u/haikusw)\
**Replies:** 1\
**Last updated:** [November 24, 2021, 7:55pm UTC](https://discuss.circleci.com/t/how-to-call-fastlane-scan-with-the-clean-parameter-using-circleci/32480 "2021-11-24T19:55:00Z")

</div>

We have an Xcode 11 iOS project and we added some swift packages to the project as dependencies. This is causing some issue with CircleCI (builds fine locally). We don’t have a fastlane configuration file, just the .ci…

---

## [Fastlane test only partially executes (# of test cases is random..?)](https://discuss.circleci.com/t/fastlane-test-only-partially-executes-of-test-cases-is-random/40109)

<div class="topic-metadata">

**Author:** [@wooyoung](https://discuss.circleci.com/u/wooyoung)\
**Replies:** 1\
**Last updated:** [November 23, 2021, 7:14am UTC](https://discuss.circleci.com/t/fastlane-test-only-partially-executes-of-test-cases-is-random/40109 "2021-11-23T07:14:28Z")

</div>

I am facing this WEIRD behavior on ci. So what I found is running xcode tests with fastlane on circleci does not run some test cases randomly and I could not found any error or fail cases but just not running even though…

---

## [How to access environment variable from CircleCI in fastfile](https://discuss.circleci.com/t/how-to-access-environment-variable-from-circleci-in-fastfile/33704)

<div class="topic-metadata">

**Author:** [@yusuf](https://discuss.circleci.com/u/yusuf)\
**Replies:** 1\
**Last updated:** [September 24, 2021, 2:06am UTC](https://discuss.circleci.com/t/how-to-access-environment-variable-from-circleci-in-fastfile/33704 "2021-09-24T02:06:11Z")

</div>

I have an environment variable called FIREBASE\_TOKEN stored on my CircleCI account. I want to access this in my fastfile, but I’m not sure how I can do that. My initial guess it to use ENV\['FIREBASE\_TOKEN'\]. Will this wo…

---

## [CircleCI Job Modifying Fastfile to a Previous or Earlier Commit](https://discuss.circleci.com/t/circleci-job-modifying-fastfile-to-a-previous-or-earlier-commit/39363)

<div class="topic-metadata">

**Author:** [@mteece](https://discuss.circleci.com/u/mteece)\
**Replies:** 4\
**Last updated:** [June 3, 2021, 4:25pm UTC](https://discuss.circleci.com/t/circleci-job-modifying-fastfile-to-a-previous-or-earlier-commit/39363 "2021-06-03T16:25:36Z")

</div>

For the past few weeks our iOS builds have been failing via errors in Fastlane. When we go to troubleshoot everything works as expected locally, and then we push those changes upstream. CircleCI is then triggered to star…

---

## [Matching Fastlane Version Required](https://discuss.circleci.com/t/matching-fastlane-version-required/37375)

<div class="topic-metadata">

**Author:** [@drewbratcher](https://discuss.circleci.com/u/drewbratcher)\
**Replies:** 2\
**Last updated:** [February 3, 2021, 3:14pm UTC](https://discuss.circleci.com/t/matching-fastlane-version-required/37375 "2021-02-03T15:14:57Z")

</div>

With the new xcode version 11.7.0 environment, we seem to have to match the exact version of fastlane to get fastlane commands to work. Here’s an example output of when our Gemfile.lock had fastlane version 2.158.0 but t…

---

## [iOS fastlane build fails with useModernBuildSystem=YES](https://discuss.circleci.com/t/ios-fastlane-build-fails-with-usemodernbuildsystem-yes/34093)

<div class="topic-metadata">

**Author:** [@triztian](https://discuss.circleci.com/u/triztian)\
**Replies:** 2\
**Last updated:** [December 10, 2020, 8:26am UTC](https://discuss.circleci.com/t/ios-fastlane-build-fails-with-usemodernbuildsystem-yes/34093 "2020-12-10T08:26:22Z")

</div>

I’ve got an XCode 12.2.1 project that fails to build using Fastlane on the tests target. It fails during the build when it’s meant to build the Image.xcassets or asset tags, my image is the following: Build-agent versio…

---

## [iOS Fastlane build fails on bundle install \`digest-crc\` dependency on Xcode 12 beta 3 image](https://discuss.circleci.com/t/ios-fastlane-build-fails-on-bundle-install-digest-crc-dependency-on-xcode-12-beta-3-image/36961)

<div class="topic-metadata">

**Author:** [@iur-kaia](https://discuss.circleci.com/u/iur-kaia)\
**Replies:** 3\
**Last updated:** [August 17, 2020, 1:48pm UTC](https://discuss.circleci.com/t/ios-fastlane-build-fails-on-bundle-install-digest-crc-dependency-on-xcode-12-beta-3-image/36961 "2020-08-17T13:48:30Z")

</div>

I am trying to adopt an already working pipeline to make builds using Xcode12 beta 3 image. One of the first steps I have is installing fastlane on the image which I run with bundle install --path .bundle. I have only F…

---

## [Bundler: failed to load command: fastlane](https://discuss.circleci.com/t/bundler-failed-to-load-command-fastlane/30372)

<div class="topic-metadata">

**Author:** [@RoohAlmahaba](https://discuss.circleci.com/u/RoohAlmahaba)\
**Replies:** 1\
**Last updated:** [August 17, 2020, 12:49pm UTC](https://discuss.circleci.com/t/bundler-failed-to-load-command-fastlane/30372 "2020-08-17T12:49:36Z")

</div>

I am facing this problem, and don’t know from where to start to solve it, what could be the problem? Blockquote bundler: failed to load command: fastlane (/home/circleci/.rubies/ruby-2.6.1/bin/fastlane) NoMethodError…

---

## [Pod command abruptly stops CircleCI job and "cancels" the build](https://discuss.circleci.com/t/pod-command-abruptly-stops-circleci-job-and-cancels-the-build/34818)

<div class="topic-metadata">

**Author:** [@soybelles](https://discuss.circleci.com/u/soybelles)\
**Replies:** 1\
**Last updated:** [March 6, 2020, 11:23am UTC](https://discuss.circleci.com/t/pod-command-abruptly-stops-circleci-job-and-cancels-the-build/34818 "2020-03-06T11:23:44Z")

</div>

So I run a pod search command in my fastlane that gets run on CircleCI that has always worked without issues in the past. Recently, it started abruptly exiting the CircleCI job without any helpful diagnostic messages (ev…

---

## [Xcode 11.0.0 builds and signs but fails on Xcode 10.3.0](https://discuss.circleci.com/t/xcode-11-0-0-builds-and-signs-but-fails-on-xcode-10-3-0/32853)

<div class="topic-metadata">

**Author:** [@aquacode](https://discuss.circleci.com/u/aquacode)\
**Replies:** 3\
**Last updated:** [October 21, 2019, 8:36am UTC](https://discuss.circleci.com/t/xcode-11-0-0-builds-and-signs-but-fails-on-xcode-10-3-0/32853 "2019-10-21T08:36:27Z")

</div>

Using fastlane and match, my iOS mobile app builds, is signed properly, and can be pushed to Test Flight fine using macox/xcode 11.0.0 image in .circleci/config.yml. However, if I switch the macos/xcode version to 10.3.…

---

## [How to run Xcode tests and then submit to Testflight](https://discuss.circleci.com/t/how-to-run-xcode-tests-and-then-submit-to-testflight/32893)

<div class="topic-metadata">

**Author:** [@yusuf](https://discuss.circleci.com/u/yusuf)\
**Replies:** 0\
**Last updated:** [October 14, 2019, 4:53pm UTC](https://discuss.circleci.com/t/how-to-run-xcode-tests-and-then-submit-to-testflight/32893 "2019-10-14T16:53:41Z")

</div>

I can run tests on CircleCI, and I can separately build and submit to Testflight. However, I can’t work out a way to run tests and then if those tests past, submit that build to Testflight. Is it possible? I’d like to do…

---

## [iOS Build - Framework Error](https://discuss.circleci.com/t/ios-build-framework-error/32575)

<div class="topic-metadata">

**Author:** [@stevexsc](https://discuss.circleci.com/u/stevexsc)\
**Replies:** 1\
**Last updated:** [September 23, 2019, 10:53pm UTC](https://discuss.circleci.com/t/ios-build-framework-error/32575 "2019-09-23T22:53:02Z")

</div>

Hi - I’m using Fastlane to build an iOS project and I have a strange problem, having some trouble figuring it out. I can build in Xcode. I can build on my local machine from the command line (fastlane beta) but when I …

---

## [Migration React Native v0.65 - Fastlane build fail for iOS "Archive failed" (Exit Status: 65) only on CircleCI](https://discuss.circleci.com/t/migration-react-native-v0-65-fastlane-build-fail-for-ios-archive-failed-exit-status-65-only-on-circleci/32585)

<div class="topic-metadata">

**Author:** [@vincentnavetat](https://discuss.circleci.com/u/vincentnavetat)\
**Replies:** 0\
**Last updated:** [September 23, 2019, 9:44am UTC](https://discuss.circleci.com/t/migration-react-native-v0-65-fastlane-build-fail-for-ios-archive-failed-exit-status-65-only-on-circleci/32585 "2019-09-23T09:44:55Z")

</div>

Working on migrating a mobile app from React Native 0.59.0 to 0.60.5 and adding support to AndroidX. The updated app works fine on both iOS and Android locally and the CircleCI build for Android is working fine. We use F…

---

## [Could not locate Gemfile or .bundle/ directory circleci when using fastlane](https://discuss.circleci.com/t/could-not-locate-gemfile-or-bundle-directory-circleci-when-using-fastlane/29809)

<div class="topic-metadata">

**Author:** [@intercoder](https://discuss.circleci.com/u/intercoder)\
**Replies:** 2\
**Last updated:** [April 24, 2019, 7:36am UTC](https://discuss.circleci.com/t/could-not-locate-gemfile-or-bundle-directory-circleci-when-using-fastlane/29809 "2019-04-24T07:36:49Z")

</div>

I’m trying to to build a react-native application both in iOS and Android, but I keep getting the error specified on the title when running the following job: - &restore-gemfile-cache key: v1-bundle-{{ checksum "i…

---

## [Having trouble building an app with fastlane](https://discuss.circleci.com/t/having-trouble-building-an-app-with-fastlane/27479)

<div class="topic-metadata">

**Author:** [@imanzarrabian](https://discuss.circleci.com/u/imanzarrabian)\
**Replies:** 7\
**Last updated:** [March 26, 2019, 4:13pm UTC](https://discuss.circleci.com/t/having-trouble-building-an-app-with-fastlane/27479 "2019-03-26T16:13:57Z")

</div>

Hi all, I’m new to CircleCI for mobile apps even if I use the plateform for backend CI/CD all the time. I’m having trouble building an iOS app on CircleCi with fastlane. The build works nicely locally but seems to be b…

---

## [Fastlane concurrent simulators cause connection abort](https://discuss.circleci.com/t/fastlane-concurrent-simulators-cause-connection-abort/26856)

<div class="topic-metadata">

**Author:** [@nikloy](https://discuss.circleci.com/u/nikloy)\
**Replies:** 0\
**Last updated:** [November 30, 2018, 11:51am UTC](https://discuss.circleci.com/t/fastlane-concurrent-simulators-cause-connection-abort/26856 "2018-11-30T11:51:38Z")

</div>

Hi, I’m facing the same issue: https://discuss.circleci.com/t/macos-plan-issue-with-xcrun-simctl-shutdown/21839 It appear when I activate the concurrent simulators in Fastlane. The error is the following: Error Domai…

---

## [Updated Fastlane version not used](https://discuss.circleci.com/t/updated-fastlane-version-not-used/25514)

<div class="topic-metadata">

**Author:** [@olegdanu-newstore](https://discuss.circleci.com/u/olegdanu-newstore)\
**Replies:** 3\
**Last updated:** [October 2, 2018, 7:15pm UTC](https://discuss.circleci.com/t/updated-fastlane-version-not-used/25514 "2018-10-02T19:15:31Z")

</div>

Hi guys. I am trying to update the Fastlane version using bundler. I can find the logs which state that Fastlane was updated to the latest v2.105.2 Fetching fastlane 2.105.2 Installing fastlane 2.105.2 But when runnin…

---

## [Fastlane randomly installs bundle twice](https://discuss.circleci.com/t/fastlane-randomly-installs-bundle-twice/25539)

<div class="topic-metadata">

**Author:** [@jvguillen](https://discuss.circleci.com/u/jvguillen)\
**Replies:** 0\
**Last updated:** [October 2, 2018, 2:45pm UTC](https://discuss.circleci.com/t/fastlane-randomly-installs-bundle-twice/25539 "2018-10-02T14:45:30Z")

</div>

Hi, I keep noticing how many of my ios builds fail due to fastlane’s attempt to copy a bundle file more than once. Here is the the exact error: :x: error: remove /Users/distiller/Library/Developer/Xcode/DerivedData/MyA…

---

## [Android Build Failing on CI Fastlane Gradle, but works fine on local machine](https://discuss.circleci.com/t/android-build-failing-on-ci-fastlane-gradle-but-works-fine-on-local-machine/24812)

<div class="topic-metadata">

**Author:** [@gregk8288](https://discuss.circleci.com/u/gregk8288)\
**Replies:** 2\
**Last updated:** [August 30, 2018, 4:31pm UTC](https://discuss.circleci.com/t/android-build-failing-on-ci-fastlane-gradle-but-works-fine-on-local-machine/24812 "2018-08-30T16:31:03Z")

</div>

Our build had to date been working fine, without any issues. Yesterday all of a sudden, exact same code base, the build started failing at the command: :app:transformNativeLibsWithStripDebugSymbolForProductionRelease FIA…

---

## [Fastlane errors after migration 1.0 to 2.0](https://discuss.circleci.com/t/fastlane-errors-after-migration-1-0-to-2-0/23194)

<div class="topic-metadata">

**Author:** [@adam1](https://discuss.circleci.com/u/adam1)\
**Replies:** 0\
**Last updated:** [June 26, 2018, 4:43pm UTC](https://discuss.circleci.com/t/fastlane-errors-after-migration-1-0-to-2-0/23194 "2018-06-26T16:43:53Z")

</div>

I am currently in the process of migrating our Circle CI config from version 1.0 to version 2.0. I have no problems when I build with Circle version 1.0, but on version 2 I get an error with fastlane. This is the deploy…

---

## [iOS - Running UITests crash on CircleCI](https://discuss.circleci.com/t/ios-running-uitests-crash-on-circleci/19531)

<div class="topic-metadata">

**Author:** [@grifas](https://discuss.circleci.com/u/grifas)\
**Replies:** 4\
**Last updated:** [June 29, 2018, 8:34pm UTC](https://discuss.circleci.com/t/ios-running-uitests-crash-on-circleci/19531 "2018-06-29T20:34:24Z")

</div>

All is on title. Running UITests success locally with fastlane scan but once on CircleCI, I get an error Exit status 65. Here my simple code: class ExampleUITests: XCTestCase { let app = XCUIApplication() overrid…

[Next page](https://discuss.circleci.com/tag/fastlane/108.md?match_all_tags=true&page=1&tags%5B%5D=fastlane)
